Target
D(3) dopamine receptor
Ligand
BDBM50182745
Substrate
Meas. Tech.
ChEMBL_1586514 (CHEMBL3821453)
Ki
6007±n/a nM
Citation
 Ofori, EZhu, XYEtukala, JRPeprah, KJordan, KRAdkins, AABricker, BAKang, HJHuang, XPRoth, BLAblordeppey, SY Design and synthesis of dual 5-HT1A and 5-HT7 receptor ligands. Bioorg Med Chem 24:3464-71 (2016)  
Target
Name:
D(3) dopamine receptor
Synonyms:
DOPAMINE D3 DRD3_HUMAN Dopamine D3 receptor (D3) Dopamine receptor Dopamine receptor D3
Type:
Mol. Mass.:
44243.43
Organism:
Homo sapiens (Human)
Description:
Residue:
400
  
Inhibitor
Name:
BDBM50182745
Synonyms:
CHEMBL3818128
Type:
Small organic molecule
Emp. Form.:
C19H23ClFN
Mol. Mass.:
319.844
SMILES:
Cl.Fc1ccc(CCCCN2CCc3ccccc3C2)cc1
: