Target
5-hydroxytryptamine receptor 2A
Ligand
BDBM50384961
Substrate
Meas. Tech.
ChEMBL_1586236 (CHEMBL3820054)
Ki
1564±n/a nM
Citation
 Etukala, JRZhu, XYEyunni, SVOnyameh, EKOfori, EBricker, BAKang, HJHuang, XPRoth, BLAblordeppey, SY Development of CNS multi-receptor ligands: Modification of known D2 pharmacophores. Bioorg Med Chem 24:3671-9 (2016)  
Target
Name:
5-hydroxytryptamine receptor 2A
Synonyms:
5-HT-2 5-HT2A 5-hydroxytryptamine receptor 2A (5HT-2A) 5HT2A_HUMAN HTR2A | Serotonin receptor 2A
Type:
undefined
Mol. Mass.:
52607.65
Organism:
Homo sapiens (Human)
Description:
P28223
Residue:
471
  
Inhibitor
Name:
BDBM50384961
Synonyms:
CHEMBL2037520
Type:
Small organic molecule
Emp. Form.:
C24H25ClN4O2S
Mol. Mass.:
468.999
SMILES:
Clc1ccc2n(C3CCN(CCCCC(=O)c4nc5ccccc5s4)CC3)c(=O)[nH]c2c1
: