Target
5-hydroxytryptamine receptor 7
Ligand
BDBM50384961
Substrate
Meas. Tech.
ChEMBL_1586237 (CHEMBL3820055)
Ki
126±n/a nM
Citation
 Etukala, JRZhu, XYEyunni, SVOnyameh, EKOfori, EBricker, BAKang, HJHuang, XPRoth, BLAblordeppey, SY Development of CNS multi-receptor ligands: Modification of known D2 pharmacophores. Bioorg Med Chem 24:3671-9 (2016)  
Target
Name:
5-hydroxytryptamine receptor 7
Synonyms:
5-HT-7 5-HT7 5-HT7S 5HT7 HTR7 | Serotonin receptor 7
Type:
G Protein-Coupled Receptor (GPCR)
Mol. Mass.:
53573.08
Organism:
Homo sapiens (Human)
Description:
P34969
Residue:
479
  
Inhibitor
Name:
BDBM50384961
Synonyms:
CHEMBL2037520
Type:
Small organic molecule
Emp. Form.:
C24H25ClN4O2S
Mol. Mass.:
468.999
SMILES:
Clc1ccc2n(C3CCN(CCCCC(=O)c4nc5ccccc5s4)CC3)c(=O)[nH]c2c1
: