Target
Glutamate receptor 1
Ligand
BDBM50184410
Substrate
Meas. Tech.
ChEMBL_1586961 (CHEMBL3825095)
IC50
243±n/a nM
Citation
 Gardinier, KMGernert, DLPorter, WJReel, JKOrnstein, PLSpinazze, PStevens, FCHahn, PHollinshead, SPMayhugh, DSchkeryantz, JKhilevich, ADe Frutos, OGleason, SDKato, ASLuffer-Atlas, DDesai, PVSwanson, SBurris, KDDing, CHeinz, BANeed, ABBarth, VNStephenson, GADiseroad, BAWoods, TAYu, HBredt, DWitkin, JM Discovery of the Firsta-Amino-3-hydroxy-5-methyl-4-isoxazolepropionic Acid (AMPA) Receptor Antagonist Dependent upon Transmembrane AMPA Receptor Regulatory Protein (TARP)¿-8. J Med Chem 59:4753-68 (2016)  
Target
Name:
Glutamate receptor 1
Synonyms:
AMPA-selective glutamate receptor 1 GLUR1 GRIA1_HUMAN GluR-A Glutamate AMPA 1 Glutamate receptor AMPA 1/2 Glutamate receptor ionotropic, AMPA 1
Type:
Enzyme Catalytic Domain
Mol. Mass.:
101512.92
Organism:
Homo sapiens (Human)
Description:
Glutamate AMPA 1 GRIA1 HUMAN::P42261
Residue:
906
  
Inhibitor
Name:
BDBM50184410
Synonyms:
CHEBI:71013 E2007 Fycompa Perampanel | Perampanel, 1
Type:
Small organic molecule
Emp. Form.:
C23H15N3O
Mol. Mass.:
349.3847
SMILES:
O=c1c(cc(cn1-c1ccccc1)-c1ccccn1)-c1ccccc1C#N
: