Target
Receptor-interacting serine/threonine-protein kinase 3
Ligand
BDBM50184765
Substrate
Meas. Tech.
ChEMBL_1587114 (CHEMBL3825649)
IC50
16±n/a nM
Citation
 Haile, PAVotta, BJMarquis, RWBury, MJMehlmann, JFSinghaus, RCharnley, AKLakdawala, ASConvery, MALipshutz, DBDesai, BMSwift, BCapriotti, CABerger, SBMahajan, MKReilly, MARivera, EJSun, HHNagilla, RBeal, AMFinger, JNCook, MNKing, BWOuellette, MTTotoritis, RDPierdomenico, MNegroni, AStronati, LCucchiara, SZiólkowski, BVossenkämper, AMacDonald, TTGough, PJBertin, JCasillas, LN The Identification and Pharmacological Characterization of 6-(tert-Butylsulfonyl)-N-(5-fluoro-1H-indazol-3-yl)quinolin-4-amine (GSK583), a Highly Potent and Selective Inhibitor of RIP2 Kinase. J Med Chem 59:4867-80 (2016)  
Target
Name:
Receptor-interacting serine/threonine-protein kinase 3
Synonyms:
RIP-3 RIP3 RIPK3_HUMAN | Receptor-interacting protein 3
Type:
PROTEIN
Mol. Mass.:
56886.12
Organism:
Homo sapiens (Human)
Description:
ChEMBL_881455
Residue:
518
  
Inhibitor
Name:
BDBM50184765
Synonyms:
CHEMBL3823499
Type:
Small organic molecule
Emp. Form.:
C20H19FN4O2S
Mol. Mass.:
398.454
SMILES:
CC(C)(C)S(=O)(=O)c1ccc2nccc(Nc3n[nH]c4ccc(F)cc34)c2c1
: