Target
Bile acid receptor
Ligand
BDBM50185709
Substrate
Meas. Tech.
ChEBML_1588253
EC50
32±n/a nM
Citation
 Kinzel, OSteeneck, CSchlüter, TSchulz, AGege, CHahn, UHambruch, EHornberger, MSpalwisz, AFrick, KPerovic-Ottstadt, SDeuschle, UBurnet, MKremoser, C Novel substituted isoxazole FXR agonists with cyclopropyl, hydroxycyclobutyl and hydroxyazetidinyl linkers: Understanding and improving key determinants of pharmacological properties. Bioorg Med Chem Lett 26:3746-53 (2016)  
Target
Name:
Bile acid receptor
Synonyms:
BAR FXR HRR1 NR1H4_HUMAN RIP14 Retinoid X receptor-interacting protein 14 | farnesoid x receptor
Type:
Nuclear Receptor
Mol. Mass.:
55916.24
Organism:
Homo sapiens (Human)
Description:
Q96RI1
Residue:
486
  
Inhibitor
Name:
BDBM50185709
Synonyms:
CHEMBL3822597
Type:
Small organic molecule
Emp. Form.:
C29H22Cl3NO4
Mol. Mass.:
554.848
SMILES:
OC(=O)c1cccc(c1)C1CC1c1ccc(OCc2c(onc2-c2c(Cl)cccc2Cl)C2CC2)cc1Cl
: