Target
Bile acid receptor
Ligand
BDBM50185710
Substrate
Meas. Tech.
ChEBML_1588253
EC50
111±n/a nM
Citation
 Kinzel, OSteeneck, CSchlüter, TSchulz, AGege, CHahn, UHambruch, EHornberger, MSpalwisz, AFrick, KPerovic-Ottstadt, SDeuschle, UBurnet, MKremoser, C Novel substituted isoxazole FXR agonists with cyclopropyl, hydroxycyclobutyl and hydroxyazetidinyl linkers: Understanding and improving key determinants of pharmacological properties. Bioorg Med Chem Lett 26:3746-53 (2016)  
Target
Name:
Bile acid receptor
Synonyms:
BAR FXR HRR1 NR1H4_HUMAN RIP14 Retinoid X receptor-interacting protein 14 | farnesoid x receptor
Type:
Nuclear Receptor
Mol. Mass.:
55916.24
Organism:
Homo sapiens (Human)
Description:
Q96RI1
Residue:
486
  
Inhibitor
Name:
BDBM50185710
Synonyms:
CHEMBL3823312
Type:
Small organic molecule
Emp. Form.:
C28H21Cl3N6O2
Mol. Mass.:
579.864
SMILES:
Clc1cccc(Cl)c1-c1noc(C2CC2)c1COc1ccc(C2CC2c2ccc(nc2)-c2nnn[nH]2)c(Cl)c1
: