Target
Bile acid receptor
Ligand
BDBM50185712
Substrate
Meas. Tech.
ChEBML_1588253
EC50
1372±n/a nM
Citation
 Kinzel, OSteeneck, CSchlüter, TSchulz, AGege, CHahn, UHambruch, EHornberger, MSpalwisz, AFrick, KPerovic-Ottstadt, SDeuschle, UBurnet, MKremoser, C Novel substituted isoxazole FXR agonists with cyclopropyl, hydroxycyclobutyl and hydroxyazetidinyl linkers: Understanding and improving key determinants of pharmacological properties. Bioorg Med Chem Lett 26:3746-53 (2016)  
Target
Name:
Bile acid receptor
Synonyms:
BAR FXR HRR1 NR1H4_HUMAN RIP14 Retinoid X receptor-interacting protein 14 | farnesoid x receptor
Type:
Nuclear Receptor
Mol. Mass.:
55916.24
Organism:
Homo sapiens (Human)
Description:
Q96RI1
Residue:
486
  
Inhibitor
Name:
BDBM50185712
Synonyms:
CHEMBL3822953
Type:
Small organic molecule
Emp. Form.:
C31H27Cl3N2O6S
Mol. Mass.:
661.98
SMILES:
OS(=O)(=O)CCNC(=O)c1ccc(cc1)C1CC1c1ccc(OCc2c(noc2C2CC2)-c2c(Cl)cccc2Cl)cc1Cl
: