Target
Adenosine receptor A3
Ligand
BDBM50187588
Substrate
Meas. Tech.
ChEBML_1590507
Ki
>1000±n/a nM
Citation
 Szymanska, EDrabczynska, AKarcz, TMüller, CEKöse, MKarolak-Wojciechowska, JFruzinski, ASchabikowski, JDoroz-Plonka, AHandzlik, JKiec-Kononowicz, K Similarities and differences in affinity and binding modes of tricyclic pyrimido- and pyrazinoxanthines at human and rat adenosine receptors. Bioorg Med Chem 24:4347-4362 (2016)  
Target
Name:
Adenosine receptor A3
Synonyms:
AA3R_RAT Adenosine receptor A2a and A3 | Adora3
Type:
PROTEIN
Mol. Mass.:
36643.73
Organism:
Rattus norvegicus
Description:
ChEMBL_479910
Residue:
320
  
Inhibitor
Name:
BDBM50187588
Synonyms:
CHEMBL3827201
Type:
Small organic molecule
Emp. Form.:
C29H42N6O3
Mol. Mass.:
522.6822
SMILES:
CCCCn1c2nc3N(CCCn3c2c(=O)n(CCCC)c1=O)c1ccc(OCCN2CCCCC2)cc1
: