Target
Adenosine receptor A2a
Ligand
BDBM50187586
Substrate
Meas. Tech.
ChEBML_1590511
Ki
2380±n/a nM
Citation
 Szymanska, EDrabczynska, AKarcz, TMüller, CEKöse, MKarolak-Wojciechowska, JFruzinski, ASchabikowski, JDoroz-Plonka, AHandzlik, JKiec-Kononowicz, K Similarities and differences in affinity and binding modes of tricyclic pyrimido- and pyrazinoxanthines at human and rat adenosine receptors. Bioorg Med Chem 24:4347-4362 (2016)  
Target
Name:
Adenosine receptor A2a
Synonyms:
A2A adenosine receptor (hA2A) ADENOSINE A2 ADORA2 Adenosine A2A receptor (A2AAR)
Type:
G Protein-Coupled Receptor (GPCR)
Mol. Mass.:
44716.46
Organism:
Homo sapiens (Human)
Description:
P29274
Residue:
412
  
Inhibitor
Name:
BDBM50187586
Synonyms:
CHEMBL3827623
Type:
Small organic molecule
Emp. Form.:
C26H36N6O3
Mol. Mass.:
480.6024
SMILES:
CCCn1c2nc3N(CCCn3c2c(=O)n(CCC)c1=O)c1ccc(OCCN2CCCC2)cc1
: