Target
Aminopeptidase N
Ligand
BDBM50393210
Substrate
Meas. Tech.
ChEBML_1591199
Ki
1.5±n/a nM
Citation
 Weglarz-Tomczak, EVassiliou, SMucha, A Discovery of potent and selective inhibitors of human aminopeptidases ERAP1 and ERAP2 by screening libraries of phosphorus-containing amino acid and dipeptide analogues. Bioorg Med Chem Lett 26:4122-6 (2016)  
Target
Name:
Aminopeptidase N
Synonyms:
AMPN_PIG AP-M Alanyl aminopeptidase Aminopeptidase N (APN) Microsomal aminopeptidase pAPN
Type:
Protein
Mol. Mass.:
108810.25
Organism:
Sus scrofa (Pig)
Description:
P15145
Residue:
963
  
Inhibitor
Name:
BDBM50393210
Synonyms:
CHEMBL1235787
Type:
Small organic molecule
Emp. Form.:
C21H27N2O5P
Mol. Mass.:
418.4232
SMILES:
CC(=N)P(O)(O)C[C@@H](Cc1ccccc1)C(=O)N[C@@H](Cc1ccccc1)C(O)=O
: