Target
Rhodopsin kinase GRK1
Ligand
BDBM50331515
Substrate
Meas. Tech.
ChEMBL_1612820 (CHEMBL3854620)
IC50
158400±n/a nM
Citation
 Guccione, MEttari, RTaliani, SDa Settimo, FZappalą, MGrasso, S G-Protein-Coupled Receptor Kinase 2 (GRK2) Inhibitors: Current Trends and Future Perspectives. J Med Chem 59:9277-9294 (2016)  
Target
Name:
Rhodopsin kinase GRK1
Synonyms:
G protein-coupled receptor kinase 1 GRK1_BOVIN Rhodopsin kinase
Type:
PROTEIN
Mol. Mass.:
62931.24
Organism:
Bos taurus
Description:
ChEMBL_116985
Residue:
561
  
Inhibitor
Name:
BDBM50331515
Synonyms:
CHEMBL1708 Paroxetine hydrochloride Paxil | Paxil cr
Type:
Small organic molecule
Emp. Form.:
C19H20FNO3
Mol. Mass.:
329.3654
SMILES:
Fc1ccc(cc1)[C@@H]1CCNC[C@H]1COc1ccc2OCOc2c1
: