Target
Fibroblast growth factor receptor 2
Ligand
BDBM50197712
Substrate
Meas. Tech.
ChEMBL_1619702 (CHEMBL3861871)
IC50
19±n/a nM
Citation
 Ebiike, HTaka, NMatsushita, MOhmori, MTakami, KHyohdoh, IKohchi, MHayase, TNishii, HMorikami, KNakanishi, YAkiyama, NShindoh, HIshii, NIsobe, TMatsuoka, H Discovery of [5-Amino-1-(2-methyl-3H-benzimidazol-5-yl)pyrazol-4-yl]-(1H-indol-2-yl)methanone (CH5183284/Debio 1347), An Orally Available and Selective Fibroblast Growth Factor Receptor (FGFR) Inhibitor. J Med Chem 59:10586-10600 (2016)  
Target
Name:
Fibroblast growth factor receptor 2
Synonyms:
BEK FGFR-2 FGFR2 Fibroblast growth factor receptor 2 (FGFR2) KGFR Keratinocyte growth factor receptor VEGF-receptor 2 and Fibroblast growth factor receptor 2
Type:
Enzyme
Mol. Mass.:
92015.45
Organism:
Homo sapiens (Human)
Description:
P21802
Residue:
821
  
Inhibitor
Name:
BDBM50197712
Synonyms:
CHEMBL3676329 | US10689705, Compound 44
Type:
Small organic molecule
Emp. Form.:
C20H15BrN6O
Mol. Mass.:
435.277
SMILES:
Cc1nc2cc(ccc2[nH]1)-n1ncc(C(=O)c2cc3ccc(Br)cc3[nH]2)c1N
: