Target
17-beta-hydroxysteroid dehydrogenase type 1
Ligand
BDBM50360232
Substrate
Meas. Tech.
ChEMBL_1619744 (CHEMBL3861913)
IC50
1270±n/a nM
Citation
 Braun, FBertoletti, NMöller, GAdamski, JSteinmetzer, TSalah, MAbdelsamie, ASvan Koppen, CJHeine, AKlebe, GMarchais-Oberwinkler, S First Structure-Activity Relationship of 17ß-Hydroxysteroid Dehydrogenase Type 14 Nonsteroidal Inhibitors and Crystal Structures in Complex with the Enzyme. J Med Chem 59:10719-10737 (2016)  
Target
Name:
17-beta-hydroxysteroid dehydrogenase type 1
Synonyms:
17-beta-HSD 1 17-beta-hydroxysteroid dehydrogenase type 1 20-alpha-HSD E17KSR EDH17B1 EDHB17 Estradiol 17-beta-dehydrogenase 1 (17beta-HSD1) Placental 17-beta-hydroxysteroid dehydrogenase | SDR28C1
Type:
Enzyme
Mol. Mass.:
34945.13
Organism:
Homo sapiens (Human)
Description:
P14061
Residue:
328
  
Inhibitor
Name:
BDBM50360232
Synonyms:
CHEMBL1928186
Type:
Small organic molecule
Emp. Form.:
C19H14FNO3
Mol. Mass.:
323.3178
SMILES:
Cc1cc(ccc1O)-c1ccc(nc1)C(=O)c1ccc(F)c(O)c1
: