Target
17-beta-hydroxysteroid dehydrogenase 14
Ligand
BDBM50197827
Substrate
Meas. Tech.
ChEMBL_1619749 (CHEMBL3861918)
Ki
7.0±n/a nM
Citation
 Braun, FBertoletti, NMöller, GAdamski, JSteinmetzer, TSalah, MAbdelsamie, ASvan Koppen, CJHeine, AKlebe, GMarchais-Oberwinkler, S First Structure-Activity Relationship of 17ß-Hydroxysteroid Dehydrogenase Type 14 Nonsteroidal Inhibitors and Crystal Structures in Complex with the Enzyme. J Med Chem 59:10719-10737 (2016)  
Target
Name:
17-beta-hydroxysteroid dehydrogenase 14
Synonyms:
17-beta-HSD 14 17-beta-hydroxysteroid dehydrogenase DHRS10 DHRS10 Dehydrogenase/reductase SDR family member 10 Retinal short-chain dehydrogenase/reductase retSDR3 SDR47C1 | Short chain dehydrogenase/reductase family 47C member 1
Type:
PROTEIN
Mol. Mass.:
28316.15
Organism:
Homo sapiens (Human)
Description:
ChEMBL_114829
Residue:
270
  
Inhibitor
Name:
BDBM50197827
Synonyms:
CHEMBL3894507
Type:
Small organic molecule
Emp. Form.:
C20H17FN2O2
Mol. Mass.:
336.3596
SMILES:
CN(C)c1cccc(c1)-c1cccc(n1)C(=O)c1ccc(F)c(O)c1
: