Target
17-beta-hydroxysteroid dehydrogenase type 2
Ligand
BDBM50360234
Substrate
Meas. Tech.
ChEMBL_1619745 (CHEMBL3861914)
IC50
260±n/a nM
Citation
 Braun, FBertoletti, NMöller, GAdamski, JSteinmetzer, TSalah, MAbdelsamie, ASvan Koppen, CJHeine, AKlebe, GMarchais-Oberwinkler, S First Structure-Activity Relationship of 17ß-Hydroxysteroid Dehydrogenase Type 14 Nonsteroidal Inhibitors and Crystal Structures in Complex with the Enzyme. J Med Chem 59:10719-10737 (2016)  
Target
Name:
17-beta-hydroxysteroid dehydrogenase type 2
Synonyms:
17-beta-Hydroxysteroid Dehydrogenase 2 (17-beta-HSD2) 20-alpha-HSD EDH17B2 Estradiol 17-beta-dehydrogenase 2 (17beta-HSD2) Microsomal 17-beta-hydroxysteroid dehydrogenas Testosterone 17-beta-dehydrogenase
Type:
Oxidoreductase; single-pass type II membrane protein
Mol. Mass.:
42795.29
Organism:
Homo sapiens (Human)
Description:
Enzyme was partially purified from human placenta.
Residue:
387
  
Inhibitor
Name:
BDBM50360234
Synonyms:
CHEMBL1928188
Type:
Small organic molecule
Emp. Form.:
C19H15NO3
Mol. Mass.:
305.3273
SMILES:
Cc1cc(ccc1O)-c1cccc(n1)C(=O)c1cccc(O)c1
: