Target
Acetylcholinesterase
Ligand
BDBM50197875
Substrate
Meas. Tech.
ChEMBL_1620053 (CHEMBL3862336)
Ki
15±n/a nM
Citation
 Wu, MYEsteban, GBrogi, SShionoya, MWang, LCampiani, GUnzeta, MInokuchi, TButini, SMarco-Contelles, J Donepezil-like multifunctional agents: Design, synthesis, molecular modeling and biological evaluation. Eur J Med Chem 121:864-879 (2016)  
Target
Name:
Acetylcholinesterase
Synonyms:
ACES_HUMAN Acetylcholinesterase (AChE) | Acetylcholinesterase (human AChE)
Type:
Enzyme
Mol. Mass.:
67792.70
Organism:
Homo sapiens (Human)
Description:
P22303
Residue:
614
  
Inhibitor
Name:
BDBM50197875
Synonyms:
CHEMBL3910142
Type:
Small organic molecule
Emp. Form.:
C29H32N4O
Mol. Mass.:
452.5906
SMILES:
Oc1cccc2ccc(CN(CC#C)C(CCC3CCN(Cc4ccccc4)CC3)C#N)nc12
: