Target
Amine oxidase [flavin-containing] A
Ligand
BDBM50197877
Substrate
Meas. Tech.
ChEMBL_1620016 (CHEMBL3862299)
IC50
35600±n/a nM
Citation
 Wu, MYEsteban, GBrogi, SShionoya, MWang, LCampiani, GUnzeta, MInokuchi, TButini, SMarco-Contelles, J Donepezil-like multifunctional agents: Design, synthesis, molecular modeling and biological evaluation. Eur J Med Chem 121:864-879 (2016)  
Target
Name:
Amine oxidase [flavin-containing] A
Synonyms:
AOFA_HUMAN MAO-A Monoamine oxidase Monoamine oxidase type A (MAO A) Monoamine oxidase type A (MAOA)
Type:
Protein
Mol. Mass.:
59689.53
Organism:
Homo sapiens (Human)
Description:
P21397
Residue:
527
  
Inhibitor
Name:
BDBM50197877
Synonyms:
CHEMBL3892118
Type:
Small organic molecule
Emp. Form.:
C27H31N3O
Mol. Mass.:
413.5545
SMILES:
Oc1cccc2ccc(CN(CCC3CCN(Cc4ccccc4)CC3)CC#C)nc12
: