Target
Amine oxidase [flavin-containing] B
Ligand
BDBM50018671
Substrate
Meas. Tech.
ChEMBL_1620017 (CHEMBL3862300)
IC50
11800±n/a nM
Citation
 Wu, MYEsteban, GBrogi, SShionoya, MWang, LCampiani, GUnzeta, MInokuchi, TButini, SMarco-Contelles, J Donepezil-like multifunctional agents: Design, synthesis, molecular modeling and biological evaluation. Eur J Med Chem 121:864-879 (2016)  
Target
Name:
Amine oxidase [flavin-containing] B
Synonyms:
AOFB_HUMAN MAOB Monoamine oxidase type B (MAO B) Monoamine oxidase type B (MAOB)
Type:
Protein
Mol. Mass.:
58768.76
Organism:
Homo sapiens (Human)
Description:
P27338
Residue:
520
  
Inhibitor
Name:
BDBM50018671
Synonyms:
CHEMBL3291019
Type:
Small organic molecule
Emp. Form.:
C29H32N4O
Mol. Mass.:
452.5906
SMILES:
Oc1ccc(CN(CC#C)C(CCC2CCN(Cc3ccccc3)CC2)C#N)c2cccnc12
: