Target
Acetylcholinesterase
Ligand
BDBM50197878
Substrate
Meas. Tech.
ChEMBL_1620019 (CHEMBL3862302)
IC50
1500±n/a nM
Citation
 Wu, MYEsteban, GBrogi, SShionoya, MWang, LCampiani, GUnzeta, MInokuchi, TButini, SMarco-Contelles, J Donepezil-like multifunctional agents: Design, synthesis, molecular modeling and biological evaluation. Eur J Med Chem 121:864-879 (2016)  
Target
Name:
Acetylcholinesterase
Synonyms:
ACES_HUMAN Acetylcholinesterase (AChE) | Acetylcholinesterase (human AChE)
Type:
Enzyme
Mol. Mass.:
67792.70
Organism:
Homo sapiens (Human)
Description:
P22303
Residue:
614
  
Inhibitor
Name:
BDBM50197878
Synonyms:
CHEMBL3961103
Type:
Small organic molecule
Emp. Form.:
C28H33N3O
Mol. Mass.:
427.5811
SMILES:
Oc1cccc2ccc(CN(CCCC3CCN(Cc4ccccc4)CC3)CC#C)nc12
: