Target
5-hydroxytryptamine receptor 2C
Ligand
BDBM50199133
Substrate
Meas. Tech.
ChEMBL_1621380 (CHEMBL3863663)
Ki
611±n/a nM
Citation
 Ofori, EZhu, XYEtukala, JRBricker, BAAblordeppey, SY Synthesis and evaluation of the structural elements in alkylated tetrahydroisoquinolines for binding to CNS receptors. Bioorg Med Chem 24:5730-5740 (2016)  
Target
Name:
5-hydroxytryptamine receptor 2C
Synonyms:
5-HT-2C 5-HT2C-INI 5-HTR2C 5-hydroxytryptamine receptor 2C (5-HT-2C) 5HT-1C HTR1C Serotonin (5-HT3) receptor Serotonin Receptor 2C
Type:
G Protein-Coupled Receptor (GPCR)
Mol. Mass.:
51836.79
Organism:
Homo sapiens (Human)
Description:
P28335
Residue:
458
  
Inhibitor
Name:
BDBM50199133
Synonyms:
CHEMBL3952251
Type:
Small organic molecule
Emp. Form.:
C20H23Cl2NO
Mol. Mass.:
364.309
SMILES:
Cl.Clc1ccc(cc1)C(=O)CCCN1CCc2ccccc2CC1
: