Target
Phosphatidylinositol 4-kinase beta
Ligand
BDBM50199899
Substrate
Meas. Tech.
ChEMBL_1621782 (CHEMBL3864065)
IC50
8000±n/a nM
Citation
 Mejdrová, IChalupská, DPlacková, PMüller, C?ála, MKlíma, MBaumlová, AHrebabecký, HProcházková, EDejmek, MStrunin, DWeber, JLee, GMatou?ová, MMertlíková-Kaiserová, HZiebuhr, JBirkus, GBoura, ENencka, R Rational Design of Novel Highly Potent and Selective Phosphatidylinositol 4-Kinase IIIß (PI4KB) Inhibitors as Broad-Spectrum Antiviral Agents and Tools for Chemical Biology. J Med Chem 60:100-118 (2017)  
Target
Name:
Phosphatidylinositol 4-kinase beta
Synonyms:
NPIK PI4K-beta PI4KB PI4Kbeta PIK4CB Phosphatidylinositol 4-kinase, PI4K | PtdIns 4-kinase beta
Type:
Protein
Mol. Mass.:
91373.30
Organism:
Homo sapiens (Human)
Description:
Residue:
816
  
Inhibitor
Name:
BDBM50199899
Synonyms:
CHEMBL3901551
Type:
Small organic molecule
Emp. Form.:
C23H24ClN5O3S
Mol. Mass.:
485.986
SMILES:
CC(C)(C)OC(=O)CCNC(=O)Nc1nc2CCc3cnc(nc3-c2s1)-c1ccccc1Cl
: