Target
Phosphatidylinositol 4-kinase beta
Ligand
BDBM50200009
Substrate
Meas. Tech.
ChEMBL_1621783 (CHEMBL3864066)
IC50
0.980000±n/a nM
Citation
 Mejdrová, IChalupská, DPlacková, PMüller, C?ála, MKlíma, MBaumlová, AHrebabecký, HProcházková, EDejmek, MStrunin, DWeber, JLee, GMatou?ová, MMertlíková-Kaiserová, HZiebuhr, JBirkus, GBoura, ENencka, R Rational Design of Novel Highly Potent and Selective Phosphatidylinositol 4-Kinase IIIß (PI4KB) Inhibitors as Broad-Spectrum Antiviral Agents and Tools for Chemical Biology. J Med Chem 60:100-118 (2017)  
Target
Name:
Phosphatidylinositol 4-kinase beta
Synonyms:
NPIK PI4K-beta PI4KB PI4Kbeta PIK4CB Phosphatidylinositol 4-kinase, PI4K | PtdIns 4-kinase beta
Type:
Protein
Mol. Mass.:
91373.30
Organism:
Homo sapiens (Human)
Description:
Residue:
816
  
Inhibitor
Name:
BDBM50200009
Synonyms:
CHEMBL3923414
Type:
Small organic molecule
Emp. Form.:
C22H27ClN6O5S
Mol. Mass.:
523.005
SMILES:
COc1ccc(cc1S(=O)(=O)N1CCOCC1)-c1c(C)nc2c(NCCNC(C)=O)cc(Cl)nn12
: