Target
Glucocorticoid receptor
Ligand
BDBM50203417
Substrate
Meas. Tech.
ChEBML_1625692
IC50
6.00±n/a nM
Citation
 Hemmerling, MEdman, KLepistö, MEriksson, AIvanova, SDahmén, JRehwinkel, HBerger, MHendrickx, RDearman, MJensen, TJWissler, LHansson, T Discovery of indazole ethers as novel, potent, non-steroidal glucocorticoid receptor modulators. Bioorg Med Chem Lett 26:5741-5748 (2016)  
Target
Name:
Glucocorticoid receptor
Synonyms:
GCR_HUMAN GRL Glucocorticoid receptor (GRFP) Nuclear receptor subfamily 3 group C member 1
Type:
Enzyme
Mol. Mass.:
85656.87
Organism:
Homo sapiens (Human)
Description:
P04150
Residue:
777
  
Inhibitor
Name:
BDBM50203417
Synonyms:
CHEMBL3914142
Type:
Small organic molecule
Emp. Form.:
C25H24FN3O3S
Mol. Mass.:
465.54
SMILES:
C[C@H](NS(=O)(=O)C1CC1)[C@H](Oc1ccc2n(ncc2c1)-c1ccc(F)cc1)c1ccccc1
: