Target
Glucocorticoid receptor
Ligand
BDBM50203431
Substrate
Meas. Tech.
ChEMBL_1625692 (CHEMBL3868161)
IC50
1.4±n/a nM
Citation
 Hemmerling, MEdman, KLepistö, MEriksson, AIvanova, SDahmén, JRehwinkel, HBerger, MHendrickx, RDearman, MJensen, TJWissler, LHansson, T Discovery of indazole ethers as novel, potent, non-steroidal glucocorticoid receptor modulators. Bioorg Med Chem Lett 26:5741-5748 (2016)  
Target
Name:
Glucocorticoid receptor
Synonyms:
GCR_HUMAN GRL Glucocorticoid receptor (GRFP) Nuclear receptor subfamily 3 group C member 1
Type:
Enzyme
Mol. Mass.:
85656.87
Organism:
Homo sapiens (Human)
Description:
P04150
Residue:
777
  
Inhibitor
Name:
BDBM50203431
Synonyms:
CHEMBL3899942
Type:
Small organic molecule
Emp. Form.:
C29H24FN3O2
Mol. Mass.:
465.5182
SMILES:
C[C@H](NC(=O)c1ccccc1)[C@H](Oc1ccc2n(ncc2c1)-c1ccc(F)cc1)c1ccccc1
: