Target
Glucocorticoid receptor
Ligand
BDBM50203420
Substrate
Meas. Tech.
ChEMBL_1625691 (CHEMBL3868160)
IC50
21±n/a nM
Citation
 Hemmerling, MEdman, KLepistö, MEriksson, AIvanova, SDahmén, JRehwinkel, HBerger, MHendrickx, RDearman, MJensen, TJWissler, LHansson, T Discovery of indazole ethers as novel, potent, non-steroidal glucocorticoid receptor modulators. Bioorg Med Chem Lett 26:5741-5748 (2016)  
Target
Name:
Glucocorticoid receptor
Synonyms:
GCR_HUMAN GRL Glucocorticoid receptor (GRFP) Nuclear receptor subfamily 3 group C member 1
Type:
Enzyme
Mol. Mass.:
85656.87
Organism:
Homo sapiens (Human)
Description:
P04150
Residue:
777
  
Inhibitor
Name:
BDBM50203420
Synonyms:
CHEMBL3976935
Type:
Small organic molecule
Emp. Form.:
C26H26FN3O3S2
Mol. Mass.:
511.631
SMILES:
CSc1ccc(cc1)[C@@H](Oc1ccc2n(ncc2c1)-c1ccc(F)cc1)[C@H](C)NS(=O)(=O)C1CC1
: