Target
Dual specificity protein kinase CLK1
Ligand
BDBM50204658
Substrate
Meas. Tech.
ChEMBL_1627842 (CHEMBL3870427)
IC50
700±n/a nM
Citation
 Lawson, MRodrigo, JBaratte, BRobert, TDelehouzé, CLozach, ORuchaud, SBach, SBrion, JDAlami, MHamze, A Synthesis, biological evaluation and molecular modeling studies of imidazo[1,2-a]pyridines derivatives as protein kinase inhibitors. Eur J Med Chem 123:105-114 (2016)  
Target
Name:
Dual specificity protein kinase CLK1
Synonyms:
CDC-like kinase 1 CDC2-like kinase 1 (CLK1) CLK1 Dual specificity protein kinase CLK1 Dual specificty protein kinase CLK1
Type:
Protein
Mol. Mass.:
57322.21
Organism:
Homo sapiens (Human)
Description:
P49759
Residue:
484
  
Inhibitor
Name:
BDBM50204658
Synonyms:
CHEMBL3908596
Type:
Small organic molecule
Emp. Form.:
C14H10BrN3O2
Mol. Mass.:
332.152
SMILES:
NC(=O)c1cc(ccc1O)-c1cn2cc(Br)ccc2n1
: