Target
Alpha-1A adrenergic receptor
Ligand
BDBM50205365
Substrate
Meas. Tech.
ChEMBL_1628379 (CHEMBL3870964)
Ki
<1995±n/a nM
Citation
 Procopiou, PAAncliff, RAGore, PMHancock, APHodgson, STHolmes, DSKeeling, SPLooker, BEParr, NARowedder, JESlack, RJ The discovery of quinoline based single-ligand human H Bioorg Med Chem Lett 26:5855-5859 (2016)  
Target
Name:
Alpha-1A adrenergic receptor
Synonyms:
ADA1A_HUMAN ADRA1C Alpha 1A-adrenoceptor Alpha adrenergic receptor 1a Alpha-adrenergic receptor 1c adrenergic Alpha1 | adrenergic Alpha1C
Type:
Cell-surface receptors
Mol. Mass.:
51511.67
Organism:
Homo sapiens (Human)
Description:
P35348
Residue:
466
  
Inhibitor
Name:
BDBM50205365
Synonyms:
CHEMBL3925977
Type:
Small organic molecule
Emp. Form.:
C31H40N4O3
Mol. Mass.:
516.6743
SMILES:
OC(=O)c1ccc2cccnc2c1N1CCN(CCc2ccc(OCCCN3CCCCCC3)cc2)CC1
: