Target
Coagulation factor VII/Tissue factor
Ligand
BDBM50205824
Substrate
Meas. Tech.
ChEMBL_1628566 (CHEMBL3871151)
Ki
6.3±n/a nM
Citation
 Richter, JMCheney, DLBates, JAWei, ALuettgen, JMRendina, ARHarper, TMNarayanan, RWong, PCSeiffert, DWexler, RRPriestley, ES Design and Synthesis of Novel Meta-Linked Phenylglycine Macrocyclic FVIIa Inhibitors. ACS Med Chem Lett 8:67-72 (2017)  
Target
Name:
Coagulation factor VII/Tissue factor
Synonyms:
Coagulation factor III/Factor VIIa (fVIIa) | Coagulation factor III/VII
Type:
Mol. Mass.:
Description:
ASSAY_ID of EBI is 69535
Components:
This complex has 2 components.
Component 1
Name:
Tissue factor
Synonyms:
CD_antigen=CD142 Coagulation factor VII/tissue factor TF Thromboplastin | Tissue factor
Type:
PROTEIN
Mol. Mass.:
33067.61
Organism:
Homo sapiens (Human)
Description:
ChEMBL_936735
Residue:
295
  
Component 2
Name:
Coagulation factor VII
Synonyms:
Eptacog alfa FA7_HUMAN Factor VIIa (fVIIa) SPCA serum prothrombin conversion accelerator
Type:
Enzyme
Mol. Mass.:
51599.89
Organism:
Homo sapiens (Human)
Description:
Residue:
466
  
Inhibitor
Name:
BDBM50205824
Synonyms:
CHEMBL3913597
Type:
Small organic molecule
Emp. Form.:
C32H34N6O4S
Mol. Mass.:
598.715
SMILES:
CN1CCc2cccc(c2)[C@@H](Nc2ccc3c(N)nccc3c2)C(=O)N(C)Cc2cc(NC1=O)ccc2S(=O)(=O)C1CC1
: