Target
D(3) dopamine receptor
Ligand
BDBM50207150
Substrate
Meas. Tech.
ChEMBL_1630050 (CHEMBL3872756)
Ki
0.058000±n/a nM
Citation
 Chen, XWSun, YYFu, LLi, JQ Synthesis and pharmacological characterization of novel N-(trans-4-(2-(4-(benzo[d]isothiazol-3-yl)piperazin-1-yl)ethyl)cyclohexyl)amides as potential multireceptor atypical antipsychotics. Eur J Med Chem 123:332-353 (2016)  
Target
Name:
D(3) dopamine receptor
Synonyms:
DOPAMINE D3 DRD3_HUMAN Dopamine D3 receptor (D3) Dopamine receptor Dopamine receptor D3
Type:
Mol. Mass.:
44243.43
Organism:
Homo sapiens (Human)
Description:
Residue:
400
  
Inhibitor
Name:
BDBM50207150
Synonyms:
CHEMBL3933256
Type:
Small organic molecule
Emp. Form.:
C24H31N5O2S2
Mol. Mass.:
485.665
SMILES:
O=S(=O)(N[C@H]1CC[C@H](CCN2CCN(CC2)c2nsc3ccccc23)CC1)c1cccnc1
: