Target
D(3) dopamine receptor
Ligand
BDBM50208987
Substrate
Meas. Tech.
ChEMBL_1633563 (CHEMBL3876355)
IC50
1.6±n/a nM
Citation
 Gunia-Krzyzak, AZelaszczyk, DRapacz, AZeslawska, EWaszkielewicz, AMPanczyk, KSloczynska, KPekala, ENitek, WFilipek, BMarona, H Structure-anticonvulsant activity studies in the group of (E)-N-cinnamoyl aminoalkanols derivatives monosubstituted in phenyl ring with 4-Cl, 4-CH Bioorg Med Chem 25:471-482 (2017)  
Target
Name:
D(3) dopamine receptor
Synonyms:
DOPAMINE D3 DRD3_HUMAN Dopamine D3 receptor (D3) Dopamine receptor Dopamine receptor D3
Type:
Mol. Mass.:
44243.43
Organism:
Homo sapiens (Human)
Description:
Residue:
400
  
Inhibitor
Name:
BDBM50208987
Synonyms:
CHEMBL3885419
Type:
Small organic molecule
Emp. Form.:
C25H31NO
Mol. Mass.:
361.5197
SMILES:
[H][C@@]12C[C@@](O)(CCN1C[C@]1([H])c3ccccc3CCc3cccc2c13)C(C)(C)C
: