Target
Dual specificity mitogen-activated protein kinase kinase 1
Ligand
BDBM50209656
Substrate
Meas. Tech.
ChEMBL_1633897 (CHEMBL3876689)
IC50
2500±n/a nM
Citation
 Tan, LGurbani, DWeisberg, ELHunter, JCLi, LJones, DSFicarro, SBMowafy, STam, CPRao, SDu, GGriffin, JDSorger, PKMarto, JAWestover, KDGray, NS Structure-guided development of covalent TAK1 inhibitors. Bioorg Med Chem 25:838-846 (2017)  
Target
Name:
Dual specificity mitogen-activated protein kinase kinase 1
Synonyms:
Dual specificity mitogen-activated protein kinase (MEK) Dual specificity mitogen-activated protein kinase kinase 1 (MEK1) Dual specificity mitogen-activated protein kinase kinase MEK1/2 MAP kinase kinase 1 MAPK/ERK kinase 1 MEK-1 MP2K1_HUMAN PRKMK1 | VHL-MAP2K1/MAP2K2
Type:
Other Protein Type
Mol. Mass.:
43439.03
Organism:
Homo sapiens (Human)
Description:
Full-length human MEK-1 was generated by PCR and purified as a fusion protein from Escherichia coli lysates.
Residue:
393
  
Inhibitor
Name:
BDBM50209656
Synonyms:
CHEMBL3883823
Type:
Small organic molecule
Emp. Form.:
C23H24Cl2N6O2
Mol. Mass.:
487.382
SMILES:
CN1CCN(CC1)c1ccc(Nc2ncc(Cl)c(Oc3ccccc3NC(=O)CCl)n2)cc1
: