Target
Translocator protein
Ligand
BDBM50210940
Substrate
Meas. Tech.
ChEMBL_1635890 (CHEMBL3878788)
Ki
23±n/a nM
Citation
 Kim, TYang, HYPark, BGJung, SYPark, JHPark, KDMin, SJTae, JYang, HCho, SCho, SJSong, HMook-Jung, ILee, JPae, AN Discovery of benzimidazole derivatives as modulators of mitochondrial function: A potential treatment for Alzheimer's disease. Eur J Med Chem 125:1172-1192 (2017)  
Target
Name:
Translocator protein
Synonyms:
Benzodiazepine receptors; peripheral & central Mbr PBR Peripheral benzodiazepine receptor (PBR) TSPO_RAT | Tspo
Type:
Mitochondrion membrane protein
Mol. Mass.:
18945.84
Organism:
Rattus norvegicus (rat)
Description:
Competitive binding experiments were performed on rat kidney mitochondrial membranes.
Residue:
169
  
Inhibitor
Name:
BDBM50210940
Synonyms:
CHEMBL3948914
Type:
Small organic molecule
Emp. Form.:
C26H25Cl2N3O
Mol. Mass.:
466.402
SMILES:
CC(C)c1ccc(C)c(NC(=O)Cn2c(Cc3c(Cl)cccc3Cl)nc3ccccc23)c1
: