Target
Translocator protein
Ligand
BDBM50210943
Substrate
Meas. Tech.
ChEMBL_1635860 (CHEMBL3878758)
IC50
1.6±n/a nM
Citation
 Kim, TYang, HYPark, BGJung, SYPark, JHPark, KDMin, SJTae, JYang, HCho, SCho, SJSong, HMook-Jung, ILee, JPae, AN Discovery of benzimidazole derivatives as modulators of mitochondrial function: A potential treatment for Alzheimer's disease. Eur J Med Chem 125:1172-1192 (2017)  
Target
Name:
Translocator protein
Synonyms:
BZRP Mitochondrial benzodiazepine receptor PKBS Peripheral-type benzodiazepine receptor TSPO_HUMAN
Type:
Enzyme
Mol. Mass.:
18834.74
Organism:
Homo sapiens (Human)
Description:
P30536
Residue:
169
  
Inhibitor
Name:
BDBM50210943
Synonyms:
CHEMBL3970955
Type:
Small organic molecule
Emp. Form.:
C23H22FNO4
Mol. Mass.:
395.4235
SMILES:
COc1ccc(OC)c(CN(C(C)=O)c2ccc(F)cc2Oc2ccccc2)c1
: