Target
Cholecystokinin receptor type A
Ligand
BDBM50211670
Substrate
Meas. Tech.
ChEMBL_40063 (CHEMBL857783)
Ki
1.5±n/a nM
Citation
  TBA Bioorg Med Chem Lett 5:3011-3016 (1995)   
Target
Name:
Cholecystokinin receptor type A
Synonyms:
CCKAR_RAT Cholecystokinin peripheral Cholecystokinin receptor type A
Type:
Enzyme Catalytic Domain
Mol. Mass.:
49676.37
Organism:
RAT
Description:
Cholecystokinin central 0 RAT::P30551
Residue:
444
  
Inhibitor
Name:
BDBM50211670
Synonyms:
CHEMBL103750
Type:
Small organic molecule
Emp. Form.:
C27H28N4O3
Mol. Mass.:
456.5362
SMILES:
CC(C)CCN1c2ccccc2N(c2ccccc2)C(=O)C(NC(=O)Nc2ccccc2)C1=O
: