Target
Cannabinoid receptor 1/2
Ligand
BDBM50172553
Substrate
Meas. Tech.
ChEMBL_46140 (CHEMBL660013)
IC50
1.2±n/a nM
Citation
  TBA Bioorg Med Chem Lett 6:17-22 (1996)   
Target
Name:
Cannabinoid receptor 1/2
Synonyms:
Cannabinoid receptor
Type:
Mol. Mass.:
Description:
ASSAY_ID of ChEMBL is 1859866
Components:
This complex has 2 components.
Component 1
Name:
Cannabinoid receptor 2
Synonyms:
CANNABINOID CB2 CB2 Cannabinoid CB2 receptor Cnr2 | rCB2
Type:
Enzyme
Mol. Mass.:
39366.68
Organism:
Rattus norvegicus (Rat)
Description:
Q9QZN9
Residue:
360
  
Component 2
Name:
Cannabinoid receptor 1
Synonyms:
Brain-type cannabinoid receptor CB-R CNR1_RAT Cannabinoid receptor Cnr1 | Skr6
Type:
G Protein-Coupled Receptor (GPCR)
Mol. Mass.:
52856.55
Organism:
Rattus norvegicus (rat)
Description:
P20272
Residue:
473
  
Inhibitor
Name:
BDBM50172553
Synonyms:
CHEMBL68641 | [1-(1-Methyl-piperidin-2-ylmethyl)-1H-indol-3-yl]-naphthalen-1-yl-methanone
Type:
Small organic molecule
Emp. Form.:
C26H26N2O
Mol. Mass.:
382.4974
SMILES:
CN1CCCCC1Cn1cc(C(=O)c2cccc3ccccc23)c2ccccc12
: