Target
C-X-C chemokine receptor type 1/2
Ligand
BDBM50214157
Substrate
Meas. Tech.
ChEMBL_89096 (CHEMBL696550)
Ki
>1000±n/a nM
Citation
  TBA Bioorg Med Chem Lett 6:1869-1874 (1996)   
Target
Name:
C-X-C chemokine receptor type 1/2
Synonyms:
Interleukin-8 receptors, CXCR1/CXCR2
Type:
Mol. Mass.:
Description:
ASSAY_ID of ChEMBL is 89096
Components:
This complex has 2 components.
Component 1
Name:
C-X-C chemokine receptor type 1
Synonyms:
C-X-C chemokine receptor type 1 (CXCR-1) CMKAR1 CXCR1_HUMAN Interleukin-8 receptor A | Interleukin-8 receptors, CXCR1/CXCR2
Type:
Enzyme
Mol. Mass.:
39803.83
Organism:
Homo sapiens (Human)
Description:
P25024
Residue:
350
  
Component 2
Name:
C-X-C chemokine receptor type 2
Synonyms:
C-X-C chemokine receptor type 2 (CXCR-2) CD_antigen=CD182 CXCR-2 CXCR2_HUMAN GRO/MGSA receptor IL-8 receptor type 2 IL8RB | Interleukin-8 receptor B
Type:
Protein
Mol. Mass.:
40767.88
Organism:
Homo sapiens (Human)
Description:
P25025
Residue:
360
  
Inhibitor
Name:
BDBM50214157
Synonyms:
CHEMBL411239
Type:
Small organic molecule
Emp. Form.:
C104H169N29O27S
Mol. Mass.:
2289.698
SMILES:
CC[C@H](C)[C@H](NC(=O)[C@H](CCCN=C(N)N)NC(=O)[C@H](CC(C)C)NC(=O)[C@@H](NC(=O)[C@H](CCSC)NC(=O)[C@H](CCCN=C(N)N)NC(=O)[C@H](Cc1c[nH]c2ccccc12)NC(=O)[C@H](CCCCN)NC(=O)[C@H](C)NC(=O)[C@@H](NC(=O)[C@H](CC(O)=O)NC(=O)[C@H](CC(N)=O)NC(=O)CNC(=O)[C@H](CC(C)C)NC(=O)[C@@H](NC(=O)[C@H](CCC(O)=O)NC(=O)[C@H](Cc1ccc(O)cc1)NC(=O)[C@H](CC)NC(=O)[C@@H](NC(C)=O)C(C)C)C(C)C)[C@@H](C)O)C(C)C)C(N)=O
: