Target
Lanosterol 14-alpha demethylase
Ligand
BDBM50215876
Substrate
Meas. Tech.
ChEMBL_151527 (CHEMBL762240)
IC50
83.0±n/a nM
Citation
 Tsukuda, TShiratori, YWatanabe, MOntsuka, HHattori, KShirai, MShimma, N Modeling, synthesis and biological activity of novel antifungal agents (1). Bioorg Med Chem Lett 8:1819-24 (1998)  
Target
Name:
Lanosterol 14-alpha demethylase
Synonyms:
CP51A_HUMAN CYP51A1 Cytochrome P450 51 LDM P450-14DM P450LI Sterol 14-alpha demethylase
Type:
Protein
Mol. Mass.:
56817.21
Organism:
Homo sapiens (Human)
Description:
Q16850
Residue:
503
  
Inhibitor
Name:
BDBM50215876
Synonyms:
CHEMBL53213 | Ro-092173
Type:
Small organic molecule
Emp. Form.:
C23H35N3O2
Mol. Mass.:
385.5429
SMILES:
CCc1ccc(CC[C@@H]2CCC(C)(C)C(OCCO)[C@H]2Cn2cncn2)cc1
: