Target
Lanosterol 14-alpha demethylase
Ligand
BDBM50215878
Substrate
Meas. Tech.
ChEMBL_151527 (CHEMBL762240)
IC50
28.1±n/a nM
Citation
 Tsukuda, TShiratori, YWatanabe, MOntsuka, HHattori, KShirai, MShimma, N Modeling, synthesis and biological activity of novel antifungal agents (1). Bioorg Med Chem Lett 8:1819-24 (1998)  
Target
Name:
Lanosterol 14-alpha demethylase
Synonyms:
CP51A_HUMAN CYP51A1 Cytochrome P450 51 LDM P450-14DM P450LI Sterol 14-alpha demethylase
Type:
Protein
Mol. Mass.:
56817.21
Organism:
Homo sapiens (Human)
Description:
Q16850
Residue:
503
  
Inhibitor
Name:
BDBM50215878
Synonyms:
CHEMBL54768 | Ro-092056
Type:
Small organic molecule
Emp. Form.:
C22H33N3O
Mol. Mass.:
355.5169
SMILES:
CCc1ccc(CC[C@@H]2CCC(C)(C)[C@H](OC)[C@H]2Cn2cncn2)cc1
: