Target
5-hydroxytryptamine receptor 1D
Ligand
BDBM50217226
Substrate
Meas. Tech.
ChEMBL_1978 (CHEMBL617583)
Ki
13±n/a nM
Citation
 Chan, WNEvans, JMHadley, MSHerdon, HJJerman, JCParsons, AARead, SJStean, TOThompson, MUpton, N Identification of (-)-cis-6-acetyl-4S-(3-chloro-4-fluoro-benzoylamino)- 3,4-dihydro-2,2-dimethyl-2H-benzo[b]pyran-3S-ol as a potential antimigraine agent. Bioorg Med Chem Lett 9:285-90 (1999)  
Target
Name:
5-hydroxytryptamine receptor 1D
Synonyms:
5-HT-1D 5-hydroxytryptamine receptor 1D Htr1d Serotonin 1B/1D receptor | Serotonin receptor 1D
Type:
Enzyme Catalytic Domain
Mol. Mass.:
41551.75
Organism:
RAT
Description:
5-HT1D HTR1D RAT::P28565
Residue:
374
  
Inhibitor
Name:
BDBM50217226
Synonyms:
CHEMBL318906
Type:
Small organic molecule
Emp. Form.:
C20H20ClNO4
Mol. Mass.:
373.83
SMILES:
CC(=O)c1ccc2OC(C)(C)[C@@H](O)[C@@H](NC(=O)c3cccc(Cl)c3)c2c1
: