Target
cAMP-specific 3',5'-cyclic phosphodiesterase 4A/4B/4C/4D
Ligand
BDBM50218578
Substrate
Meas. Tech.
ChEMBL_156922 (CHEMBL763956)
Ki
17±n/a nM
Citation
 Napoletano, MNorcini, GPellacini, FMarchini, FMorazzoni, GFerlenga, PPradella, L Phthalazine PDE4 inhibitors. Part 2: the synthesis and biological evaluation of 6-methoxy-1,4-disubstituted derivatives. Bioorg Med Chem Lett 11:33-7 (2001)  
Target
Name:
cAMP-specific 3',5'-cyclic phosphodiesterase 4A/4B/4C/4D
Synonyms:
Phosphodiesterase 4
Type:
Mol. Mass.:
Description:
ASSAY_ID of ChEMBL is 788178
Components:
This complex has 4 components.
Component 1
Name:
cAMP-specific 3',5'-cyclic phosphodiesterase 4A
Synonyms:
3',5'-cyclic phosphodiesterase PDE46 PDE4A_HUMAN Phosphodiesterase 4A | Phosphodiesterase 4A (PDE4)
Type:
Enzyme
Mol. Mass.:
98113.27
Organism:
Homo sapiens (Human)
Description:
P27815
Residue:
886
  
Component 2
Name:
cAMP-specific 3',5'-cyclic phosphodiesterase 4D
Synonyms:
3',5'-cyclic phosphodiesterase PDE43 PDE4D_HUMAN | Phosphodiesterase 4D
Type:
Protein
Mol. Mass.:
91092.69
Organism:
Homo sapiens (Human)
Description:
Q08499
Residue:
809
  
Component 3
Name:
cAMP-specific 3',5'-cyclic phosphodiesterase 4B
Synonyms:
3',5'-cyclic phosphodiesterase Isoform PDE4B1 PDE4B PDE4B_HUMAN Phosphodiesterase 4B (PDE4B) Phosphodiesterase Type 4 (PDE4B)
Type:
Protein
Mol. Mass.:
83318.87
Organism:
Homo sapiens (Human)
Description:
Q07343
Residue:
736
  
Component 4
Name:
cAMP-specific 3',5'-cyclic phosphodiesterase 4C
Synonyms:
3',5'-cyclic phosphodiesterase NP_000914.2 PDE4C | PDE4C1
Type:
Enzyme Catalytic Domain
Mol. Mass.:
79875.54
Organism:
Homo sapiens (Human)
Description:
Q08493
Residue:
712
  
Inhibitor
Name:
BDBM50218578
Synonyms:
CHEMBL79902
Type:
Small organic molecule
Emp. Form.:
C18H12Cl2N4O2S
Mol. Mass.:
419.284
SMILES:
COc1ccc2c(Cc3c(Cl)c[n+]([O-])cc3Cl)nnc(-c3nccs3)c2c1
: