Target
D(2) dopamine receptor
Ligand
BDBM28583
Substrate
Meas. Tech.
ChEMBL_60550 (CHEMBL670660)
Ki
2512±n/a nM
Citation
 Bromidge, SMClarke, SEKing, FDLovell, PJNewman, HRiley, GRoutledge, CSerafinowska, HTSmith, DRThomas, DR Bicyclic piperazinylbenzenesulphonamides are potent and selective 5-HT6 receptor antagonists. Bioorg Med Chem Lett 12:1357-60 (2002)  
Target
Name:
D(2) dopamine receptor
Synonyms:
D(2) dopamine receptor DOPAMINE D2 Long DRD2 Dopamine D2 receptor Dopamine D2 receptor (D2R) Dopamine2-like | d2
Type:
Cell-surface receptors
Mol. Mass.:
50647.10
Organism:
Homo sapiens (Human)
Description:
P14416
Residue:
443
  
Inhibitor
Name:
BDBM28583
Synonyms:
5-chloro-N-[4-methoxy-3-(piperazin-1-yl)phenyl]-3-methyl-1-benzothiophene-2-sulfonamide hydrochloride SB 271046 | SB-271046
Type:
Small organic molecule
Emp. Form.:
C20H22ClN3O3S2
Mol. Mass.:
451.99
SMILES:
COc1ccc(NS(=O)(=O)c2sc3ccc(Cl)cc3c2C)cc1N1CCNCC1
: