Target
Alpha-1A adrenergic receptor
Ligand
BDBM50220746
Substrate
Meas. Tech.
ChEMBL_33887 (CHEMBL643759)
Ki
0.039811±n/a nM
Citation
 Lopez, FJArias, LChan, RClarke, DEElworthy, TRFord, APGuzman, AJaime-Figueroa, SJasper, JRMorgans, DJPadilla, FPerez-Medrano, AQuintero, CRomero, MSandoval, LSmith, SAWilliams, TJBlue, DR Synthesis, pharmacology and pharmacokinetics of 3-(4-aryl-piperazin-1-ylalkyl)-uracils as uroselective alpha1A-antagonists. Bioorg Med Chem Lett 13:1873-8 (2003)  
Target
Name:
Alpha-1A adrenergic receptor
Synonyms:
ADA1A_HUMAN ADRA1C Alpha 1A-adrenoceptor Alpha adrenergic receptor 1a Alpha-adrenergic receptor 1c adrenergic Alpha1 | adrenergic Alpha1C
Type:
Cell-surface receptors
Mol. Mass.:
51511.67
Organism:
Homo sapiens (Human)
Description:
P35348
Residue:
466
  
Inhibitor
Name:
BDBM50220746
Synonyms:
CHEMBL292189
Type:
Small organic molecule
Emp. Form.:
C21H27F3N4O3
Mol. Mass.:
440.4593
SMILES:
Cc1[nH]c(=O)n(CCCN2CCN(CC2)c2ccccc2OCC(F)(F)F)c(=O)c1C
: