Target
Prostacyclin receptor
Ligand
BDBM50223835
Substrate
Meas. Tech.
ChEMBL_157784 (CHEMBL857865)
Ki
63±n/a nM
Citation
 Clark, RDJahangir, ASeverance, DSalazar, RChang, TChang, DJett, MFSmith, SBley, K Discovery and SAR development of 2-(phenylamino) imidazolines as prostacyclin receptor antagonists [corrected]. Bioorg Med Chem Lett 14:1053-6 (2004)  
Target
Name:
Prostacyclin receptor
Synonyms:
PGI receptor PRIPR Prostacyclin (IP) Receptor Prostaglandin I Prostaglandin I2 receptor | Prostanoid IP receptor
Type:
G Protein-Coupled Receptor (GPCR)
Mol. Mass.:
40968.22
Organism:
Homo sapiens (Human)
Description:
The membranes prepared from human platelet were used in binding assay.
Residue:
386
  
Inhibitor
Name:
BDBM50223835
Synonyms:
CHEMBL273530
Type:
Small organic molecule
Emp. Form.:
C17H19N3OS
Mol. Mass.:
313.417
SMILES:
COc1ccc(Sc2ccc(NC3=NC(C)CN3)cc2)cc1
: