Target
Beta-1/Beta-2/Beta-3 adrenergic receptor
Ligand
BDBM50222196
Substrate
Meas. Tech.
ChEMBL_38885 (CHEMBL652716)
Ki
4000±n/a nM
Citation
 Brossi, ARice, KCMak, CPReden, JJacobson, AENimitkitpaisan, YSkolnick, PDaly, J Mammalian alkaloids. 8. Synthesis and biological effects of tetrahydropapaveroline related 1-benzyltetrahydroisoquinolines. J Med Chem 23:648-52 (1980)  
Target
Name:
Beta-1/Beta-2/Beta-3 adrenergic receptor
Synonyms:
Adrenergic receptor beta
Type:
Mol. Mass.:
Description:
ASSAY_ID of ChEMBL is 1340543
Components:
This complex has 3 components.
Component 1
Name:
Beta-1 adrenergic receptor
Synonyms:
ADRB1R, B1AR Adrb1 Adrenergic receptor beta Beta-1 adrenoreceptor adrenergic Beta1,2
Type:
Protein
Mol. Mass.:
50486.84
Organism:
Rattus norvegicus (Rat)
Description:
P18090
Residue:
466
  
Component 2
Name:
Beta-2 adrenergic receptor
Synonyms:
ADRB2_RAT Adrb2r | Adrenergic receptor beta
Type:
PROTEIN
Mol. Mass.:
46896.26
Organism:
Rattus norvegicus
Description:
ChEMBL_38603
Residue:
418
  
Component 3
Name:
Beta-3 adrenergic receptor
Synonyms:
ADRB3_RAT Adrb3r Beta-3 adrenergic receptor
Type:
PROTEIN
Mol. Mass.:
43161.83
Organism:
Rattus norvegicus
Description:
ChEMBL_1509452
Residue:
400
  
Inhibitor
Name:
BDBM50222196
Synonyms:
CHEBI:46816 | CHEMBL155707
Type:
Small organic molecule
Emp. Form.:
C18H21NO4
Mol. Mass.:
315.3636
SMILES:
COc1ccc(CC2NCCc3cc(OC)c(O)cc23)cc1O
: