Target
D(1A)/D(1B)/D(2)/D(3)/D(4) dopamine receptor
Ligand
BDBM50026553
Substrate
Meas. Tech.
ChEMBL_60016 (CHEMBL675841)
IC50
2.5±n/a nM
Citation
 Grol, CJJansen, LJRollema, H Resolution of 5,6-dihydroxy-2-(N,N-di-n-propylamino)tetralin in relation to the structural and stereochemical requirements for centrally acting dopamine agonists. J Med Chem 28:679-83 (1985)  
Target
Name:
D(1A)/D(1B)/D(2)/D(3)/D(4) dopamine receptor
Synonyms:
Dopamine receptor
Type:
Mol. Mass.:
Description:
ASSAY_ID of ChEMBL is 60018
Components:
This complex has 5 components.
Component 1
Name:
D(2) dopamine receptor
Synonyms:
DOPAMINE D2 DOPAMINE D2 Short Dopamine D2 receptor Drd2
Type:
G Protein-Coupled Receptor (GPCR)
Mol. Mass.:
50931.60
Organism:
Rattus norvegicus (rat)
Description:
P61169
Residue:
444
  
Component 2
Name:
D(1A) dopamine receptor
Synonyms:
DOPAMINE D1 Dopamine D1 high Dopamine receptor Dopamine1-like Drd1a
Type:
Enzyme Catalytic Domain
Mol. Mass.:
49429.75
Organism:
RAT
Description:
P18901
Residue:
446
  
Component 3
Name:
D(3) dopamine receptor
Synonyms:
DOPAMINE D3 Dopamine D3 receptor | Drd3
Type:
Protein
Mol. Mass.:
49540.58
Organism:
Rattus norvegicus (Rat)
Description:
P19020
Residue:
446
  
Component 4
Name:
D(4) dopamine receptor
Synonyms:
D(4) dopamine receptor DOPAMINE D4.4 Dopamine receptor | Drd4
Type:
Enzyme Catalytic Domain
Mol. Mass.:
41307.65
Organism:
RAT
Description:
DOPAMINE D4.4 0 RAT::P30729
Residue:
387
  
Component 5
Name:
D(1B) dopamine receptor
Synonyms:
D(1B) dopamine receptor DRD5_RAT Dopamine D5 receptor Drd5
Type:
Enzyme Catalytic Domain
Mol. Mass.:
52827.88
Organism:
RAT
Description:
Dopamine D1B 0 RAT::P25115
Residue:
475
  
Inhibitor
Name:
BDBM50026553
Synonyms:
(+)-6-Dipropylamino-5,6,7,8-tetrahydro-naphthalene-1,2-diol (-)-6-Dipropylamino-5,6,7,8-tetrahydro-naphthalene-1,2-diol 6-Dipropylamino-5,6,7,8-tetrahydro-naphthalene-1,2-diol (DP-5,6-ADTN) | CHEMBL11845
Type:
Small organic molecule
Emp. Form.:
C16H25NO2
Mol. Mass.:
263.3752
SMILES:
CCCN(CCC)C1CCc2c(C1)ccc(O)c2O
: