Target
Alpha-2A adrenergic receptor [16-465]/Alpha-2B adrenergic receptor/Alpha-2C adrenergic receptor
Ligand
BDBM50029051
Substrate
Meas. Tech.
ChEMBL_34070 (CHEMBL643927)
IC50
33±n/a nM
Citation
 DeBernardis, JFKyncl, JJBasha, FZArendsen, DLMartin, YCWinn, MKerkman, DJ Conformationally defined adrenergic agents. 2. Catechol imidazoline derivatives: biological effects at alpha 1 and alpha 2 adrenergic receptors. J Med Chem 29:463-7 (1986)  
Target
Name:
Alpha-2A adrenergic receptor [16-465]/Alpha-2B adrenergic receptor/Alpha-2C adrenergic receptor
Synonyms:
Adrenergic receptor alpha-2
Type:
Mol. Mass.:
Description:
ASSAY_ID of ChEMBL is 935397
Components:
This complex has 3 components.
Component 1
Name:
Alpha-2C adrenergic receptor
Synonyms:
ADA2C_RAT Adrenergic receptor alpha adrenergic Alpha2 | adrenergic Alpha2C
Type:
Enzyme Catalytic Domain
Mol. Mass.:
49890.50
Organism:
RAT
Description:
adrenergic Alpha2 0 RAT::P22086
Residue:
458
  
Component 2
Name:
Alpha-2B adrenergic receptor
Synonyms:
ADA2B_RAT Adrenergic receptor alpha Alpha-2B adrenergic receptor Alpha-2B adrenoreceptor | adrenergic Alpha2B
Type:
Enzyme Catalytic Domain
Mol. Mass.:
50379.83
Organism:
NEONATAL RAT
Description:
adrenergic Alpha2B ADRA2B NEONATAL RAT::P19328
Residue:
453
  
Component 3
Name:
Alpha-2A adrenergic receptor [16-465]
Synonyms:
ADA2A_RAT Adrenaline 2 Alpha-2A adrenoceptor Alpha-2AAR Alpha2 Adrenoreceptor adrenergic Alpha2A
Type:
G-protein coupled receptor
Mol. Mass.:
48961.69
Organism:
Rattus norvegicus (rat)
Description:
P22909[16-465]
Residue:
450
  
Inhibitor
Name:
BDBM50029051
Synonyms:
(-)-arterenol (-)-norepinephrine (R)-4-(2-amino-1-hydroxyethyl)-1,2-benzenediol (R)-norepinephrine CHEMBL1437 | NOREPINEPHRINE
Type:
Small organic molecule
Emp. Form.:
C8H11NO3
Mol. Mass.:
169.1778
SMILES:
NC[C@H](O)c1ccc(O)c(O)c1
: