Target
Beta-1/Beta-2/Beta-3 adrenergic receptor
Ligand
BDBM50226969
Substrate
Meas. Tech.
ChEMBL_38741 (CHEMBL651099)
IC50
3.1±n/a nM
Citation
 Milecki, JBaker, SPStandifer, KMIshizu, TChida, YKusiak, JWPitha, J Carbostyril derivatives having potent beta-adrenergic agonist properties. J Med Chem 30:1563-6 (1987)  
Target
Name:
Beta-1/Beta-2/Beta-3 adrenergic receptor
Synonyms:
Adrenergic receptor beta
Type:
Mol. Mass.:
Description:
ASSAY_ID of ChEMBL is 1340543
Components:
This complex has 3 components.
Component 1
Name:
Beta-1 adrenergic receptor
Synonyms:
ADRB1R, B1AR Adrb1 Adrenergic receptor beta Beta-1 adrenoreceptor adrenergic Beta1,2
Type:
Protein
Mol. Mass.:
50486.84
Organism:
Rattus norvegicus (Rat)
Description:
P18090
Residue:
466
  
Component 2
Name:
Beta-2 adrenergic receptor
Synonyms:
ADRB2_RAT Adrb2r | Adrenergic receptor beta
Type:
PROTEIN
Mol. Mass.:
46896.26
Organism:
Rattus norvegicus
Description:
ChEMBL_38603
Residue:
418
  
Component 3
Name:
Beta-3 adrenergic receptor
Synonyms:
ADRB3_RAT Adrb3r Beta-3 adrenergic receptor
Type:
PROTEIN
Mol. Mass.:
43161.83
Organism:
Rattus norvegicus
Description:
ChEMBL_1509452
Residue:
400
  
Inhibitor
Name:
BDBM50226969
Synonyms:
CHEMBL39915
Type:
Small organic molecule
Emp. Form.:
C21H24N2O3
Mol. Mass.:
352.4269
SMILES:
CC(C)(Cc1ccccc1)NCC(O)c1ccc(O)c2nc(O)ccc12
: