Target
5-hydroxytryptamine receptor 2A/2B/2C
Ligand
BDBM10755
Substrate
Meas. Tech.
ChEMBL_2227 (CHEMBL617172)
Kd
3162±n/a nM
Citation
 King, FDBrown, AMGaster, LMKaumann, AJMedhurst, ADParker, SGParsons, AAPatch, TLRaval, P (+/-) 3-Amino-6-carboxamido-1,2,3,4-tetrahydrocarbazole: a conformationally restricted analogue of 5-carboxamidotryptamine with selectivity for the serotonin 5-HT1D receptor. J Med Chem 36:1918-9 (1993)  
Target
Name:
5-hydroxytryptamine receptor 2A/2B/2C
Synonyms:
Serotonin 2 (5-HT2) receptor
Type:
Mol. Mass.:
Description:
ASSAY_ID of ChEMBL is 306637
Components:
This complex has 3 components.
Component 1
Name:
5-hydroxytryptamine receptor 2B
Synonyms:
5-HT-2B 5-hydroxytryptamine (serotonin) receptor 2B [Homo sapiens] 5-hydroxytryptamine receptor 2C (5HT2C) HTR2B Serotonin 2b (5-HT2b) receptor | Serotonin Receptor 2B
Type:
G Protein-Coupled Receptor (GPCR)
Mol. Mass.:
54312.47
Organism:
Homo sapiens (Human)
Description:
Receptor binding assays were performed using human clone stably expressed in CHO cells.
Residue:
481
  
Component 2
Name:
5-hydroxytryptamine receptor 2C
Synonyms:
5-HT-2C 5-HT2C-INI 5-HTR2C 5-hydroxytryptamine receptor 2C (5-HT-2C) 5HT-1C HTR1C Serotonin (5-HT3) receptor Serotonin Receptor 2C
Type:
G Protein-Coupled Receptor (GPCR)
Mol. Mass.:
51836.79
Organism:
Homo sapiens (Human)
Description:
P28335
Residue:
458
  
Component 3
Name:
5-hydroxytryptamine receptor 2A
Synonyms:
5-HT-2 5-HT2A 5-hydroxytryptamine receptor 2A (5HT-2A) 5HT2A_HUMAN HTR2A | Serotonin receptor 2A
Type:
undefined
Mol. Mass.:
52607.65
Organism:
Homo sapiens (Human)
Description:
P28223
Residue:
471
  
Inhibitor
Name:
BDBM10755
Synonyms:
14C-5-hydroxy tryptamine creatinine disulfate 5-HT 5-hydroxy tryptamine creatinine disulfate Serotonin | [3H]-5-HT
Type:
Small organic molecule
Emp. Form.:
C10H12N2O
Mol. Mass.:
176.2151
SMILES:
NCCc1c[nH]c2ccc(O)cc12
: