Target
Prostaglandin G/H synthase 1
Ligand
BDBM50102311
Substrate
Meas. Tech.
ChEBML_1646193
IC50
>10000±n/a nM
Citation
 Cherukupalli, SKarpoormath, RChandrasekaran, BHampannavar, GAThapliyal, NPalakollu, VN An insight on synthetic and medicinal aspects of pyrazolo[1,5-a]pyrimidine scaffold. Eur J Med Chem 126:298-352 (2017)  
Target
Name:
Prostaglandin G/H synthase 1
Synonyms:
COX-1 Cyclooxygenase Cyclooxygenase-1 (COX-1) PTGS1 | Prostaglandin G/H synthase (cyclooxygenase)
Type:
Enzyme
Mol. Mass.:
68692.62
Organism:
Homo sapiens (Human)
Description:
P23219
Residue:
599
  
Inhibitor
Name:
BDBM50102311
Synonyms:
3-(4-Fluoro-phenyl)-2-(4-methanesulfonyl-phenyl)-6,7-dimethyl-pyrazolo[1,5-a]pyrimidine | CHEMBL331921
Type:
Small organic molecule
Emp. Form.:
C21H18FN3O2S
Mol. Mass.:
395.45
SMILES:
Cc1cnc2c(c(nn2c1C)-c1ccc(cc1)S(C)(=O)=O)-c1ccc(F)cc1
: